{"text_format":"1","workbook":"xlsx","n_sheets":3,"sheets":["Sheet1","Drop down lists","Master"],"not_rendered":{"charts":0,"images":0,"macros":1,"external_links":1,"defined_names":51,"comments":0,"pivot_tables":0},"unopened":[],"bounds":{"document_bytes":16777216,"sheet_cells":100000,"rows_first":2000,"rows_last":500,"rows_between":2000,"halvings":0,"cell_chars":16384,"cell_head_chars":4096},"cells_cut":0,"cells_raw":0,"read":"whole","date_system":"1900"}

{"sheet":"Sheet1","index":0,"n_rows":18,"n_cols":11,"rows_kept":18,"cut":false,"hidden":false,"merged":[[0,0,0,10],[1,0,1,10],[6,2,6,7],[6,8,6,10],[8,0,9,0],[8,1,8,2],[8,3,8,6],[8,7,8,10],[17,0,17,2],[17,3,17,6],[17,7,17,10],[3,0,3,7],[10,4,14,4],[10,7,14,7],[10,8,14,8],[10,9,14,9],[10,10,14,10],[15,0,15,2],[15,7,15,10],[16,0,16,2],[16,7,16,10],[15,3,15,6],[16,3,16,6]]}
["HEALTH CONNECT SUPRA"]
["Benefit Illustration in respect of policies offered on individual and family floater basis"]
["Plan","Super Top up Option I","Deductible",500000,"Sum Insured",1000000,"Policy Tenure","1 year"]
["Otional Covers"]
["Reload of Sum Insured","No","AYUSH Treatment","No","World-Wide Coverage","No","Wellness & Assistance","No"]
["1st Adult Age",40,"2nd Adult Age",38,"1st Child Age",null,"2nd Child Age"]
["3rd Child Age",null,null,null,null,null,null,null,"UIN: LIBHLIP23124V032223"]
[]
["Age of the members insured","Coverage opted on individual basis covering each member of the family separately (at a single point in time)",null,"Coverage opted on individual basis covering multiple members of the family under a single policy (Sum insured is available for each member of the family)",null,null,null,"Coverage opted on family floater basis with overall Sum insured (Only one sum insured is available for the entire family)"]
[null,"Premium (Rs.)","Sum insured (Rs.)","Premium (Rs.)","Discount, (if any)","Premium after discount (Rs.)","Sum insured (Rs.)","Premium or consolidated premium for all members of family (Rs.)","Floater discount, if any","Premium after discount (Rs.)","Sum insured"]
[{"$f":"B6","v":40},{"$f":"Master!BF5","v":1287},{"$f":"IF(B6=\"\",0,$F$3)","v":1000000},{"$f":"Master!BM5","v":1287},{"$f":"IF(AND(COUNT(Master!AT5:AT9)>=2,H3=\"1 year\"),\"Family Discount: 10%\",IF(AND(COUNT(Master!AT5:AT9)>=2,H3=\"2 years\"),\"Family Discount: 10% & Long Term Discount: 7.5%\",IF(AND(COUNT(Master!AT5:AT9)>=2,H3=\"3 years\"),\"Family Discount: 10% & Long Term Discount: 10%\",IF(AND(COUNT(Master!AT5:AT9)=1,H3=\"1 year\"),\"0%\",IF(AND(COUNT(Master!AT5:AT9)=1,H3=\"2 years\"),\"Long Term Discount: 7.5%\",\"Long Term Discount: 10%\")))))","v":"Family Discount: 10%"},{"$f":"Master!BP5","v":1158.3},{"$f":"IF(B6=\"\",0,$F$3)","v":1000000},{"$f":"IF(Master!BE13=\"Available floater combinations - 1A1C, 1A2C, 1A3C, 2A, 2A1C, 2A2C or 2A3C\",\"Available floater combinations - 1A1C, 1A2C, 1A3C, 2A, 2A1C, 2A2C or 2A3C\",\"Base Plan Rs.\"&\" \"&ROUND(Master!BS5,0)&\"                                                                \"&\"Optional Cover Rs.\"&Master!BA12)","v":"Base Plan Rs. 2574                                                                Optional Cover Rs.0"},{"$f":"IF(Master!BE13=\"Available floater combinations - 1A1C, 1A2C, 1A3C, 2A, 2A1C, 2A2C or 2A3C\",0%,Master!BH20)","v":0.2},{"$f":"IF(Master!BE13=\"Available floater combinations - 1A1C, 1A2C, 1A3C, 2A, 2A1C, 2A2C or 2A3C\",0,Master!BU5)","v":2059},{"$f":"IF(Master!BE13=\"Available floater combinations - 1A1C, 1A2C, 1A3C, 2A, 2A1C, 2A2C or 2A3C\",0,F3)","v":1000000}]
[{"$f":"D6","v":38},{"$f":"Master!BF6","v":1287},{"$f":"IF(D6=\"\",0,$F$3)","v":1000000},{"$f":"Master!BM6","v":1287},null,{"$f":"Master!BP6","v":1158.3},{"$f":"IF(D6=\"\",0,$F$3)","v":1000000}]
[{"$f":"F6","v":0},{"$f":"Master!BF7","v":0},{"$f":"IF(F6=\"\",0,$F$3)","v":0},{"$f":"Master!BF7","v":0},null,{"$f":"Master!BP7","v":0},{"$f":"IF(F6=\"\",0,$F$3)","v":0}]
[{"$f":"H6","v":0},{"$f":"Master!BF8","v":0},{"$f":"IF(H6=\"\",0,$F$3)","v":0},{"$f":"Master!BF8","v":0},null,{"$f":"Master!BP8","v":0},{"$f":"IF(H6=\"\",0,$F$3)","v":0}]
[{"$f":"B7","v":0},{"$f":"Master!BF9","v":0},{"$f":"IF(B7=\"\",0,$F$3)","v":0},{"$f":"Master!BF9","v":0},null,{"$f":"Master!BP9","v":0},{"$f":"IF(B7=\"\",0,$F$3)","v":0}]
{"$rows_left_out":4}
{"sheet":"Drop down lists","index":1,"n_rows":67,"n_cols":21,"rows_kept":67,"cut":false,"hidden":true,"merged":[[0,2,0,4],[0,6,0,7],[9,0,9,2]]}
["Top up","Super Top up","Deductible_Top up",null,null,null,"Deductible Super Top up",null,null,"Sum Insured Top up I","Sum Insured Top up II","Sum Insured Top up III",null,"Sum Insured Super Top up I","Sum Insured Super Top up II",null,"Age",null,null,"Plan Option","Policy Tenure"]
["I","I",50000,200000,500000,null,200000,1000000,null,50000,300000,1000000,null,300000,1000000,null,"3-11 Months",null,null,"Top up Option I","1 year"]
["II","II",null,300000,750000,null,300000,1500000,null,100000,500000,1500000,null,500000,1500000,null,1,null,null,"Top up Option II","2 years"]
["III",null,null,400000,1000000,null,400000,2000000,null,150000,700000,2000000,null,700000,2000000,null,2,null,null,"Top up Option III","3 years"]
[null,null,null,500000,null,null,500000,3000000,null,200000,null,null,null,1000000,3000000,null,3,null,null,"Super Top up Option I"]
[null,null,null,null,null,null,750000,4000000,null,null,null,null,null,1500000,5000000,null,4,null,null,"Super Top up Option II"]
["Yes",null,null,50000,50000,null,1000000,null,null,null,null,null,null,2000000,10000000,null,5]
["No",null,"op 1",null,100000,null,null,null,null,null,null,null,null,null,null,null,6]
[null,null,null,null,150000,null,200000,300000,null,1000000,1000000,null,null,null,null,null,7]
[null,null,null,null,200000,null,null,500000,null,null,1500000,null,null,"NA",0,null,8]
[null,null,null,null,null,null,null,700000,null,null,2000000,null,null,null,1,null,9]
[null,null,null,200000,300000,null,null,1000000,null,null,3000000,null,null,"Yes",2,null,10]
[null,null,null,null,500000,null,null,1500000,null,null,5000000,null,null,"No",3,null,11]
[null,null,null,null,700000,null,null,2000000,null,null,10000000,null,null,null,4,null,12]
[null,null,null,null,null,null,300000,300000,null,1500000,1000000,null,null,null,5,null,13]
{"$rows_left_out":53}
{"sheet":"Master","index":2,"n_rows":134,"n_cols":73,"rows_kept":134,"cut":false,"hidden":true,"merged":[[4,65,8,65],[4,66,8,66],[37,60,37,72],[37,31,37,36],[46,0,46,1],[37,1,37,6],[37,7,37,12],[37,13,37,18],[37,19,37,24],[37,25,37,30],[26,1,26,3],[26,4,26,6],[26,7,26,9],[48,1,48,6],[48,7,48,12],[48,13,48,18],[48,19,48,24],[48,25,48,30],[2,52,2,55],[37,45,37,57],[13,49,13,51],[13,0,13,1],[15,1,15,3],[15,4,15,6],[15,7,15,9],[15,10,15,12],[15,54,15,56],[35,0,35,1],[24,0,24,1]]}
[]
["Top up Option I",null,null,null,null,null,null,null,null,null,null,null,null,null,null,null,null,null,null,null,null,null,null,null,null,null,null,null,null,null,null,null,null,null,null,null,null,null,null,null,{"$f":"BA4","v":"Base Premium"},null,null,null,"Working"]
["Deductible",50000,null,null,null,null,null,null,null,null,null,null,null,null,null,null,null,null,null,null,null,null,null,null,null,null,null,null,null,null,null,null,null,null,null,null,null,null,null,null,"1 year","2 years","3 years"]
["Age Band/SI",50000,100000,150000,200000,null,null,null,null,null,null,null,null,null,null,null,null,null,null,null,null,null,null,null,null,null,null,null,null,null,null,null,null,null,null,null,null,null,null,null,{"$f":"IFERROR(INDEX($AS$39:$BF$134,MATCH(CONCATENATE(AW5&AV5&AX5),$AS$39:$AS$134,0),MATCH(AY5,$AS$39:$BF$39,0)),0)","v":1287},{"$f":"AO4*$AP$11","v":2574},{"$f":"AO4*$AQ$11","v":3861},null,"Sr. No.","No.of Insured","DOB","Age band","Plan","Deductible","Sum Insured","SI band","Base Premium","Family Floater discount","AYUSH","World Wide Cover","Reload","Premium","Wellness",null,null,"Multi Policy Year Discount",null,null,"Separate prm for each ind with longterm disc","Family Discount","Long Term Discount","Ind prm post discount",null,"Floater premium","Floater premium with long term discount","Floater Discount","Final Floater Premium"]
["91 days - 40 years",745.87500000000023,1022.1250000000003,1381.2500000000005,1740.3750000000007,null,null,null,null,null,null,null,null,null,null,null,null,null,null,null,null,null,null,null,null,null,null,null,null,null,null,null,null,null,null,null,null,null,null,null,{"$f":"IFERROR(INDEX($AS$39:$BF$134,MATCH(CONCATENATE(AW6&AV6&AX6),$AS$39:$AS$134,0),MATCH(AY6,$AS$39:$BF$39,0)),0)","v":1287},{"$f":"AO5*$AP$11","v":2574},{"$f":"AO5*$AQ$11","v":3861},null,null,{"$f":"IF(AU5=\"\",\"\",1)","v":1},{"$f":"IF(Sheet1!B6=\"\",\"\",Sheet1!A11)","v":40},{"$f":"IFERROR(LOOKUP(AU5,Master!$AS$16:$AU$20),0)","v":"91 days - 40 years"},{"$f":"IF(AU5=\"\",\"\",Sheet1!$B$3)","v":"Super Top up Option I"},{"$f":"IF(AU5=\"\",\"\",Sheet1!$D$3)","v":500000},{"$f":"IF(AU5=\"\",\"\",Sheet1!$F$3)","v":1000000},{"$f":"LOOKUP((AY5+AX5),$AS$22:$AU$24)","v":">8 & <= 15Lacs"},{"$f":"IFERROR(IF(Sheet1!$H$3=Master!$AO$3,Master!$AO4,(IF(Sheet1!$H$3=Master!$AP$3,Master!$AP4,(IF(Sheet1!$H$3=Master!$AQ$3,Master!$AQ4,0))))),0)","v":1287},null,{"$f":"IF(Sheet1!$D$5=\"Yes\",$AX$24*BA5,0)","v":0},{"$f":"IF(Sheet1!$F$5=\"Yes\",IFERROR(IF(Sheet1!$H$3=Master!$BN$14,Master!$BN15,(IF(Sheet1!$H$3=Master!$BO$14,Master!$BO15,(IF(Sheet1!$H$3=Master!$BP$14,Master!$BP15,0))))),0),0)","v":0},{"$f":"IFERROR(IF(Sheet1!$B$5=\"Yes\",Master!AY27,0),0)","v":0},{"$f":"SUM(BA5:BE5)","v":1287},{"$f":"IF(Sheet1!$H$5=\"Yes\",IF(Sheet1!$H$3=$AO$14,AO15,IF(Sheet1!$H$3=$AP$14,AP15,IF(Sheet1!$H$3=$AQ$14,AQ15,0))),0)","v":0},null,null,null,"2 years","3 years",{"$f":"BF5*(100%-$BO$5)","v":1287},{"$f":"IF(COUNT(AT5:AT9)>=2,10%,0%)","v":0.1},{"$f":"IF(Sheet1!H3=\"3 years\",10%,IF(Sheet1!H3=\"2 years\",7.5%,0%))","v":0},{"$f":"BF5*(100%-$BN$5-$BO$5)","v":1158.3},"Base Premium",{"$f":"BA11","v":2574},{"$f":"(BR5*(100%-$BO$5))","v":2574},{"$f":"BS5*(100%-BH20)","v":2059.2000000000003},{"$f":"IF(BE13=\"Available floater combinations - 1A1C, 1A2C, 1A3C, 2A, 2A1C, 2A2C or 2A3C\",0,ROUND(SUM(BT5:BT7),0))","v":2059}]
["41 years  - 50 years",1314.4950000000001,1801.345,2434.2500000000009,3067.1550000000007,null,null,null,null,null,null,null,null,null,null,null,null,null,null,null,null,null,null,null,null,null,null,null,null,null,null,null,null,null,null,null,null,null,null,null,{"$f":"IFERROR(INDEX($AS$39:$BF$134,MATCH(CONCATENATE(AW7&AV7&AX7),$AS$39:$AS$134,0),MATCH(AY7,$AS$39:$BF$39,0)),0)","v":0},{"$f":"AO6*$AP$11","v":0},{"$f":"AO6*$AQ$11","v":0},null,null,{"$f":"IF(AU6=\"\",\"\",1)","v":1},{"$f":"IF(Sheet1!D6=\"\",\"\",Sheet1!A12)","v":38},{"$f":"IFERROR(LOOKUP(AU6,Master!$AS$16:$AU$20),0)","v":"91 days - 40 years"},{"$f":"IF(AU6=\"\",\"\",Sheet1!$B$3)","v":"Super Top up Option I"},{"$f":"IF(AU6=\"\",\"\",Sheet1!$D$3)","v":500000},{"$f":"IF(AU6=\"\",\"\",Sheet1!$F$3)","v":1000000},{"$f":"LOOKUP((AY6+AX6),$AS$22:$AU$24)","v":">8 & <= 15Lacs"},{"$f":"IFERROR(IF(Sheet1!$H$3=Master!$AO$3,Master!$AO5,(IF(Sheet1!$H$3=Master!$AP$3,Master!$AP5,(IF(Sheet1!$H$3=Master!$AQ$3,Master!$AQ5,0))))),0)","v":1287},null,{"$f":"IF(Sheet1!$D$5=\"Yes\",$AX$24*BA6,0)","v":0},{"$f":"IF(Sheet1!$F$5=\"Yes\",IFERROR(IF(Sheet1!$H$3=Master!$BN$14,Master!$BN16,(IF(Sheet1!$H$3=Master!$BO$14,Master!$BO16,(IF(Sheet1!$H$3=Master!$BP$14,Master!$BP16,0))))),0),0)","v":0},{"$f":"IFERROR(IF(Sheet1!$B$5=\"Yes\",Master!AY28,0),0)","v":0},{"$f":"SUM(BA6:BE6)","v":1287},{"$f":"IF(Sheet1!$H$5=\"Yes\",IF(Sheet1!$H$3=$AO$14,AO16,IF(Sheet1!$H$3=$AP$14,AP16,IF(Sheet1!$H$3=$AQ$14,AQ16,0))),0)","v":0},null,null,"Disc amount",{"$f":"$BF$10*7.5%","v":193.04999999999998},{"$f":"$BF$10*10%","v":257.40000000000003},{"$f":"BF6*(100%-$BO$5)","v":1287},null,null,{"$f":"BF6*(100%-$BN$5-$BO$5)","v":1158.3},"Optional Cover",{"$f":"SUM(BC11:BE11)","v":0},{"$f":"(BR6*(100%-$BO$5))","v":0},{"$f":"BS6","v":0}]
["51 years  - 60 years",2316.6000000000004,3174.6000000000008,4290.0000000000009,5405.4000000000015,null,null,null,null,null,null,null,null,null,null,null,null,null,null,null,null,null,null,null,null,null,null,null,null,null,null,null,null,null,null,null,null,null,null,null,{"$f":"IFERROR(INDEX($AS$39:$BF$134,MATCH(CONCATENATE(AW8&AV8&AX8),$AS$39:$AS$134,0),MATCH(AY8,$AS$39:$BF$39,0)),0)","v":0},{"$f":"AO7*$AP$11","v":0},{"$f":"AO7*$AQ$11","v":0},null,null,{"$f":"IF(AU7=\"\",\"\",1)","v":""},{"$f":"IF(Sheet1!F6=\"\",\"\",IF(Sheet1!A13=\"3-11 Months\",0.25,Sheet1!A13))","v":""},{"$f":"IFERROR(LOOKUP(AU7,Master!$AS$16:$AU$20),0)","v":0},{"$f":"IF(AU7=\"\",\"\",Sheet1!$B$3)","v":""},{"$f":"IF(AU7=\"\",\"\",Sheet1!$D$3)","v":""},{"$f":"IF(AU7=\"\",\"\",Sheet1!$F$3)","v":""},{"$error":"#VALUE!"},{"$f":"IFERROR(IF(Sheet1!$H$3=Master!$AO$3,Master!$AO6,(IF(Sheet1!$H$3=Master!$AP$3,Master!$AP6,(IF(Sheet1!$H$3=Master!$AQ$3,Master!$AQ6,0))))),0)","v":0},null,{"$f":"IF(Sheet1!$D$5=\"Yes\",$AX$24*BA7,0)","v":0},{"$f":"IF(Sheet1!$F$5=\"Yes\",IFERROR(IF(Sheet1!$H$3=Master!$BN$14,Master!$BN17,(IF(Sheet1!$H$3=Master!$BO$14,Master!$BO17,(IF(Sheet1!$H$3=Master!$BP$14,Master!$BP17,0))))),0),0)","v":0},{"$f":"IFERROR(IF(Sheet1!$B$5=\"Yes\",Master!AY29,0),0)","v":0},0,{"$f":"IF(Sheet1!$H$5=\"Yes\",IF(Sheet1!$H$3=$AO$14,AO17,IF(Sheet1!$H$3=$AP$14,AP17,IF(Sheet1!$H$3=$AQ$14,AQ17,0))),0)","v":0},null,null,null,null,null,0,null,null,0,"Wellness",{"$f":"BG11","v":0},{"$f":"BR7","v":0},{"$f":"BS7","v":0}]
["61 years  - 65 years",4668.3000000000011,6397.3000000000011,8645.0000000000018,10892.7,null,null,null,null,null,null,null,null,null,null,null,null,null,null,null,null,null,null,null,null,null,null,null,null,null,null,null,null,null,null,null,null,null,null,null,{"$f":"IFERROR(INDEX($AS$39:$BF$134,MATCH(CONCATENATE(AW9&AV9&AX9),$AS$39:$AS$134,0),MATCH(AY9,$AS$39:$BF$39,0)),0)","v":0},{"$f":"AO8*$AP$11","v":0},{"$f":"AO8*$AQ$11","v":0},null,null,{"$f":"IF(AU8=\"\",\"\",1)","v":""},{"$f":"IF(Sheet1!H6=\"\",\"\",IF(Sheet1!A14=\"3-11 Months\",0.25,Sheet1!A14))","v":""},{"$f":"IFERROR(LOOKUP(AU8,Master!$AS$16:$AU$20),0)","v":0},{"$f":"IF(AU8=\"\",\"\",Sheet1!$B$3)","v":""},{"$f":"IF(AU8=\"\",\"\",Sheet1!$D$3)","v":""},{"$f":"IF(AU8=\"\",\"\",Sheet1!$F$3)","v":""},{"$error":"#VALUE!"},{"$f":"IFERROR(IF(Sheet1!$H$3=Master!$AO$3,Master!$AO7,(IF(Sheet1!$H$3=Master!$AP$3,Master!$AP7,(IF(Sheet1!$H$3=Master!$AQ$3,Master!$AQ7,0))))),0)","v":0},null,{"$f":"IF(Sheet1!$D$5=\"Yes\",$AX$24*BA8,0)","v":0},{"$f":"IF(Sheet1!$F$5=\"Yes\",IFERROR(IF(Sheet1!$H$3=Master!$BN$14,Master!$BN18,(IF(Sheet1!$H$3=Master!$BO$14,Master!$BO18,(IF(Sheet1!$H$3=Master!$BP$14,Master!$BP18,0))))),0),0)","v":0},{"$f":"IFERROR(IF(Sheet1!$B$5=\"Yes\",Master!AY30,0),0)","v":0},0,{"$f":"IF(Sheet1!$H$5=\"Yes\",IF(Sheet1!$H$3=$AO$14,AO18,IF(Sheet1!$H$3=$AP$14,AP18,IF(Sheet1!$H$3=$AQ$14,AQ18,0))),0)","v":0},null,null,null,null,null,0,null,null,0,null,null,{"$f":"BS6+BS7","v":0}]
["Above 65 years",8143.2000000000007,11159.2,15080,19000.8,null,null,null,null,null,null,null,null,null,null,null,null,null,null,null,null,null,null,null,null,null,null,null,null,null,null,null,null,null,null,null,null,null,null,null,null,null,null,null,null,{"$f":"IF(AU9=\"\",\"\",1)","v":""},{"$f":"IF(Sheet1!B7=\"\",\"\",IF(Sheet1!A15=\"3-11 Months\",0.25,Sheet1!A15))","v":""},{"$f":"IFERROR(LOOKUP(AU9,Master!$AS$16:$AU$20),0)","v":0},{"$f":"IF(AU9=\"\",\"\",Sheet1!$B$3)","v":""},{"$f":"IF(AU9=\"\",\"\",Sheet1!$D$3)","v":""},{"$f":"IF(AU9=\"\",\"\",Sheet1!$F$3)","v":""},{"$error":"#VALUE!"},{"$f":"IFERROR(IF(Sheet1!$H$3=Master!$AO$3,Master!$AO8,(IF(Sheet1!$H$3=Master!$AP$3,Master!$AP8,(IF(Sheet1!$H$3=Master!$AQ$3,Master!$AQ8,0))))),0)","v":0},null,{"$f":"IF(Sheet1!$D$5=\"Yes\",$AX$24*BA9,0)","v":0},{"$f":"IF(Sheet1!$F$5=\"Yes\",IFERROR(IF(Sheet1!$H$3=Master!$BN$14,Master!$BN19,(IF(Sheet1!$H$3=Master!$BO$14,Master!$BO19,(IF(Sheet1!$H$3=Master!$BP$14,Master!$BP19,0))))),0),0)","v":0},{"$f":"IFERROR(IF(Sheet1!$B$5=\"Yes\",Master!AY31,0),0)","v":0},0,{"$f":"IF(Sheet1!$H$5=\"Yes\",IF(Sheet1!$H$3=$AO$14,AO19,IF(Sheet1!$H$3=$AP$14,AP19,IF(Sheet1!$H$3=$AQ$14,AQ19,0))),0)","v":0},null,null,null,null,null,0,null,null,0]
[null,null,null,null,null,null,null,null,null,null,null,null,null,null,null,null,null,null,null,null,null,null,null,null,null,null,null,null,null,null,null,null,null,null,null,null,null,null,null,null,null,null,null,null,null,null,null,null,null,null,"Total (Individual)",null,{"$f":"SUM(BA5:BA9)","v":2574},null,{"$f":"IF(Sheet1!$D$5=\"Yes\",SUM(BC5:BC9),0)","v":0},{"$f":"IF(Sheet1!$F$5=\"Yes\",SUM(BD5:BD9),0)","v":0},{"$f":"SUM(BE5:BE9)","v":0},{"$f":"SUM(BA10:BE10)","v":2574},{"$f":"IF(Sheet1!$H$5=\"Yes\",SUM(BG5:BG9),0)","v":0},null,null,null,null,null,{"$f":"ROUND(SUM(BM5:BM9)+BG10,0)","v":2574},null,null,{"$f":"SUM(BP5:BP9)","v":2316.6},null,{"$f":"\"Total Premium for all members of the family is, Rs.\"&\" \"&BM10&\" \"&\"(excluding GST & Stamp Duty) when each member is covered separately.\"","v":"Total Premium for all members of the family is, Rs. 2574 (excluding GST & Stamp Duty) when each member is covered separately."},{"$f":"\"Total Premium for all members of the family is, Rs.\"&\" \"&BP11&\" \"&\"(excluding GST & Stamp Duty)  when they are covered under a single policy\"","v":"Total Premium for all members of the family is, Rs. 2317 (excluding GST & Stamp Duty)  when they are covered under a single policy"},{"$f":"\"Total Premium when policy is opted on floater basis is, Rs.\"&\" \"&BU5&\" \"&\"(excluding GST & Stamp Duty)\"","v":"Total Premium when policy is opted on floater basis is, Rs. 2059 (excluding GST & Stamp Duty)"}]
[null,null,null,null,null,null,null,null,null,null,null,null,null,null,null,null,null,null,null,null,null,null,null,null,null,null,null,null,null,null,null,null,null,null,null,null,null,null,null,null,1,2,3,null,null,null,null,null,null,null,"Total (Family floater)",null,{"$f":"SUM(BA5:BA9)","v":2574},{"$f":"-IF(COUNT(AT5:AT6)>=1,Master!BH21,0)","v":-514.80000000000007},{"$f":"IF(Sheet1!$D$5=\"Yes\",$BA$11*$AX$24,0)","v":0},{"$f":"IF(Sheet1!$F$5=\"Yes\",Master!BN24,0)","v":0},{"$f":"IF(Sheet1!$B$5=\"Yes\",Master!$AX$22,0)","v":0},{"$f":"SUM(BA11:BE11)","v":2059.1999999999998},{"$f":"IF(AND(Sheet1!$H$5=\"Yes\",Sheet1!H3=\"1 year\"),Master!AO15,IF(AND(Sheet1!$H$5=\"Yes\",Sheet1!$H$3=\"2 years\"),Master!AP15,IF(AND(Sheet1!$H$5=\"Yes\",Sheet1!$H$3=\"3 years\"),Master!AQ15,0)))*COUNT(Master!AT5:AT9)","v":0},null,null,null,null,null,null,null,"with wellness",{"$f":"ROUND(BP10+BG10,0)","v":2317},null,{"$f":"\"Sum insured available for each individual is Rs.\"&\" \"&Sheet1!F3&\" \"&\"with deductible of Rs.\"&\" \"&Sheet1!D3&\" \"&\"under Health Connect Supra policy\"","v":"Sum insured available for each individual is Rs. 1000000 with deductible of Rs. 500000 under Health Connect Supra policy"},{"$f":"\"Sum insured available for each family member is Rs.\"&\" \"&Sheet1!F3&\" \"&\"with deductible of Rs.\"&\" \"&Sheet1!D3&\" \"&\"under Health Connect Supra policy\"","v":"Sum insured available for each family member is Rs. 1000000 with deductible of Rs. 500000 under Health Connect Supra policy"},{"$f":"IF(BE13=\"Available floater combinations - 1A1C, 1A2C, 1A3C, 2A, 2A1C, 2A2C or 2A3C\",\"Sum insured of Rs.\"&\" \"&0&\" \"&\"with deductible of Rs.\"&\" \"&0&\" \"&\"is available for the entire family.\",\"Sum insured of Rs.\"&\" \"&Sheet1!F3&\" \"&\"with deductible of Rs.\"&\" \"&Sheet1!D3&\" \"&\"is available for the entire family.\")","v":"Sum insured of Rs. 1000000 with deductible of Rs. 500000 is available for the entire family."}]
[null,null,null,null,null,null,null,null,null,null,null,null,null,null,null,null,null,null,null,null,null,null,null,null,null,null,null,null,null,null,null,null,null,null,null,null,null,null,null,null,null,null,null,null,null,null,null,null,null,null,null,null,{"$f":"ROUND(BC11+BD11+BE11+BG11,0)","v":0},null,null,null,null,null,null,null,null,null,null,null,null,"BN","BO","BP"]
[null,null,null,null,null,null,null,null,null,null,null,null,null,null,null,null,null,null,null,null,null,null,null,null,null,null,null,null,null,null,null,null,null,null,null,null,null,null,null,null,"Wellness",null,null,null,null,null,null,null,"Reload Calc (Family Floater)","Loading",null,null,null,"Family Floater Disc Calc",null,"Floter Type",{"$f":"IF(AND(SUM($AT$5:$AT$6)=1,SUM($AT$7:$AT$9)=1),\"1A1C\",IF(AND(SUM($AT$5:$AT$6)=1,SUM($AT$7:$AT$9)=2),\"1A2C\",IF(AND(SUM($AT$5:$AT$6)=1,SUM($AT$7:$AT$9)=3),\"1A3C\",IF(AND(SUM($AT$5:$AT$6)=2,SUM($AT$7:$AT$9)=0),\"2A\",IF(AND(SUM($AT$5:$AT$6)=2,SUM($AT$7:$AT$9)=1),\"2A1C\",IF(AND(SUM($AT$5:$AT$6)=2,SUM($AT$7:$AT$9)=2),\"2A2C\",IF(AND(SUM($AT$5:$AT$6)=2,SUM($AT$7:$AT$9)=3),\"2A3C\",\"Available floater combinations - 1A1C, 1A2C, 1A3C, 2A, 2A1C, 2A2C or 2A3C\")))))))","v":"2A"},null,"Family Floater Premium Calc",null,null,null,null,"World Wide Cover",null,"AO","AP","AQ"]
["Top Up",null,"Option II",null,null,null,null,null,null,null,null,null,null,null,null,null,null,null,null,null,null,null,null,null,null,null,null,null,null,null,null,null,null,null,null,null,null,null,null,null,"1 year","2 years","3 years",null,null,null,null,null,null,"Deductible + Sum Insured",null,null,null,"Per child",0.15,null,null,null,"Floater disc","Adult",null,"Children",null,"Sr. No.","Insured Name","1 year","2 years","3 years"]
["Top up Option II",null,null,null,null,null,null,null,null,null,null,null,null,null,null,null,null,null,null,null,null,null,null,null,null,null,null,null,null,null,null,null,null,null,null,null,null,null,null,{"$f":"AT5","v":1},{"$f":"IF(AN15=1,400,0)","v":400},{"$f":"AO15*$AP$21","v":800},{"$f":"AO15*$AQ$21","v":1200},null,"Age band",null,null,null,"Age Bands/Sum Insured","Up to 8 Lacs",">8 & <= 15Lacs",">15 Lacs",null,"For addition of 1 adult, the discount will be:",null,null,null,null,"Highest Age",{"$f":"MAX($AU$5:$AU$9)","v":40},null,null,null,{"$f":"AS5","v":0},{"$f":"AT5","v":1},{"$f":"IFERROR(INDEX($BH$39:$BU$94,MATCH(CONCATENATE(AW5&AV5&AX5),$BH$39:$BH$94,0),MATCH(AY5,$BH$39:$BU$39,0)),0)","v":985},{"$f":"BN15*2","v":1970},{"$f":"BN15*3","v":2955}]
{"$rows_left_out":119}